Target
Tyrosine-protein kinase JAK1 [866-1154]
Ligand
BDBM264185
Substrate
Meas. Tech.
JAK Enzymatic Assay
pH
7.3±n/a
IC50
110±n/a nM
Comments
extracted
Citation
 Grimster, NKawatkar, SKettle, JGSu, QVasbinder, MChuaqui, CE Compounds and methods for inhibiting JAK US Patent  US9714236 Publication Date 7/25/2017 
Target
Name:
Tyrosine-protein kinase JAK1 [866-1154]
Synonyms:
JAK1 JAK1A JAK1_HUMAN Tyrosine-protein kinase JAK1 (aa 866-1154)
Type:
Protein
Mol. Mass.:
33185.74
Organism:
Homo sapiens (Human)
Description:
P23458[866-1154]
Residue:
289
  
Inhibitor
Name:
BDBM264185
Synonyms:
(2R)-N-(3-{2-[(3- ethoxy-1-methyl-1H- pyrazol-4-yl)amino]-5- fluoropyrimidin-4-yl}- 1H-indol-7-yl)-2- (4-ethylpiperazin-1- yl)propanamide US10654835, Example 8 US9714236, 8
Type:
Small organic molecule
Emp. Form.:
C27H34FN9O2
Mol. Mass.:
535.6164
SMILES:
CCOc1nn(C)cc1Nc1ncc(F)c(n1)-c1c[nH]c2c(NC(=O)[C@@H](C)N3CCN(CC)CC3)cccc12
: