Target
Tyrosine-protein kinase JAK1 [866-1154]
Ligand
BDBM264207
Substrate
Meas. Tech.
JAK Enzymatic Assay
pH
7.3±n/a
IC50
106±n/a nM
Comments
extracted
Citation
 Grimster, NKawatkar, SKettle, JGSu, QVasbinder, MChuaqui, CE Compounds and methods for inhibiting JAK US Patent  US9714236 Publication Date 7/25/2017 
Target
Name:
Tyrosine-protein kinase JAK1 [866-1154]
Synonyms:
JAK1 JAK1A JAK1_HUMAN Tyrosine-protein kinase JAK1 (aa 866-1154)
Type:
Protein
Mol. Mass.:
33185.74
Organism:
Homo sapiens (Human)
Description:
P23458[866-1154]
Residue:
289
  
Inhibitor
Name:
BDBM264207
Synonyms:
(2R)-2-(4- ethylpiperidin-1-yl)-N-(3- {2-[(3-methoxy-1- methyl-1H-pyrazol- 4-yl)amino]pyrimidin- 4-yl}-1H-indol- 7-yl)propanamide US10654835, Example 28 US9714236, 28
Type:
Small organic molecule
Emp. Form.:
C26H33N9O2
Mol. Mass.:
503.5993
SMILES:
CCN1CCN(CC1)[C@H](C)C(=O)Nc1cccc2c(c[nH]c12)-c1ccnc(Nc2cn(C)nc2OC)n1
: