Target
Tyrosine-protein kinase JAK1 [866-1154]
Ligand
BDBM264220
Substrate
Meas. Tech.
JAK Enzymatic Assay
pH
7.3±n/a
IC50
24.0±n/a nM
Comments
extracted
Citation
 Grimster, NKawatkar, SKettle, JGSu, QVasbinder, MChuaqui, CE Compounds and methods for inhibiting JAK US Patent  US9714236 Publication Date 7/25/2017 
Target
Name:
Tyrosine-protein kinase JAK1 [866-1154]
Synonyms:
JAK1 JAK1A JAK1_HUMAN Tyrosine-protein kinase JAK1 (aa 866-1154)
Type:
Protein
Mol. Mass.:
33185.74
Organism:
Homo sapiens (Human)
Description:
P23458[866-1154]
Residue:
289
  
Inhibitor
Name:
BDBM264220
Synonyms:
(2R)-N-(3-{5-chloro- 2-[(3-ethoxy-1- methyl-1H-pyrazol-4- yl)amino]pyrimidin-4- yl}-1H-indol-7-yl)-2- (4-methylpiperazin-1- yl)propanamide US10654835, Example 40 US9714236, 40
Type:
Small organic molecule
Emp. Form.:
C26H32ClN9O2
Mol. Mass.:
538.044
SMILES:
CCOc1nn(C)cc1Nc1ncc(Cl)c(n1)-c1c[nH]c2c(NC(=O)[C@@H](C)N3CCN(C)CC3)cccc12
: