Target
Tyrosine-protein kinase JAK1 [866-1154]
Ligand
BDBM264238
Substrate
Meas. Tech.
JAK Enzymatic Assay
pH
7.3±n/a
IC50
17.0±n/a nM
Comments
extracted
Citation
 Grimster, NKawatkar, SKettle, JGSu, QVasbinder, MChuaqui, CE Compounds and methods for inhibiting JAK US Patent  US9714236 Publication Date 7/25/2017 
Target
Name:
Tyrosine-protein kinase JAK1 [866-1154]
Synonyms:
JAK1 JAK1A JAK1_HUMAN Tyrosine-protein kinase JAK1 (aa 866-1154)
Type:
Protein
Mol. Mass.:
33185.74
Organism:
Homo sapiens (Human)
Description:
P23458[866-1154]
Residue:
289
  
Inhibitor
Name:
BDBM264238
Synonyms:
(2R)-N-(3-{2-[(1- ethyl-3-methoxy-1H- pyrazol-4-yl)amino]-5- methylpyrimidin-4- yl}-1H-indol-7-yl)- 2-(4-methylpiperazin-1- yl)propanamide US10654835, Example 58 US9714236, 58
Type:
Small organic molecule
Emp. Form.:
C27H35N9O2
Mol. Mass.:
517.6259
SMILES:
CCn1cc(Nc2ncc(C)c(n2)-c2c[nH]c3c(NC(=O)[C@@H](C)N4CCN(C)CC4)cccc23)c(OC)n1
: