Target
Lysine-specific histone demethylase 1A
Ligand
BDBM256633
Substrate
Meas. Tech.
LSD1 Inhibitory Assay
pH
8±n/a
Temperature
298.15±n/a K
IC50
<100.0±n/a nM
Comments
extracted
Citation
 Matsumoto, SHattori, YToyofuku, MMorimoto, SKojima, TKaku, TIto, M Cyclopropanamine compound and use thereof US Patent  US9714241 Publication Date 7/25/2017 
Target
Name:
Lysine-specific histone demethylase 1A
Synonyms:
AOF2 Flavin-containing amine oxidase domain-containing protein 2 KDM1A KIAA0601 Lysine-specific demethylase 1 (LSD1) Lysine-specific histone demethylase 1 (LSD1)
Type:
Enzyme
Mol. Mass.:
92901.01
Organism:
Homo sapiens (Human)
Description:
O60341
Residue:
852
  
Inhibitor
Name:
BDBM256633
Synonyms:
US10053456, 12 US10968213, Example 12 US9718814, 12 | US9920047, 12
Type:
Small organic molecule
Emp. Form.:
C24H32F2N2O3
Mol. Mass.:
434.5193
SMILES:
FC1(F)CCC(CC1)NC(=O)c1cc2CCOc2c(c1)C1CC1NCC1CCOCC1
: