Target
Amine oxidase [flavin-containing] B
Ligand
BDBM243404
Substrate
Meas. Tech.
MAO-B Inhibitory Assay
pH
7.5±n/a
Temperature
298.15±n/a K
IC50
>100000±n/a nM
Comments
extracted
Citation
 Matsumoto, SHattori, YToyofuku, MMorimoto, SKojima, TKaku, TIto, M Cyclopropanamine compound and use thereof US Patent  US9714241 Publication Date 7/25/2017 
Target
Name:
Amine oxidase [flavin-containing] B
Synonyms:
AOFB_HUMAN MAOB Monoamine oxidase type B (MAO B) Monoamine oxidase type B (MAOB)
Type:
Protein
Mol. Mass.:
58768.76
Organism:
Homo sapiens (Human)
Description:
P27338
Residue:
520
  
Inhibitor
Name:
BDBM243404
Synonyms:
N-cyclopentyl-5- ((1R,2R)-2- (tetrahydro-2H- pyran-4-ylamino)- cyclopropyl)thio- phene-3-carboxamide US10053456, 39 US10968213, Example 39 US9920047, 39
Type:
Small organic molecule
Emp. Form.:
C18H26N2O2S
Mol. Mass.:
334.476
SMILES:
O=C(NC1CCCC1)c1csc(c1)C1CC1NC1CCOCC1
: