Target
Lysine-specific histone demethylase 1A
Ligand
BDBM256691
Substrate
Meas. Tech.
LSD1 Inhibitory Assay
pH
8±n/a
Temperature
298.15±n/a K
IC50
<100.0±n/a nM
Comments
extracted
Citation
 Matsumoto, SHattori, YToyofuku, MMorimoto, SKojima, TKaku, TIto, M Cyclopropanamine compound and use thereof US Patent  US9714241 Publication Date 7/25/2017 
Target
Name:
Lysine-specific histone demethylase 1A
Synonyms:
AOF2 Flavin-containing amine oxidase domain-containing protein 2 KDM1A KIAA0601 Lysine-specific demethylase 1 (LSD1) Lysine-specific histone demethylase 1 (LSD1)
Type:
Enzyme
Mol. Mass.:
92901.01
Organism:
Homo sapiens (Human)
Description:
O60341
Residue:
852
  
Inhibitor
Name:
BDBM256691
Synonyms:
US10053456, 70 US10968213, Example 70 US9718814, 70
Type:
Small organic molecule
Emp. Form.:
C18H24N4O2S2
Mol. Mass.:
392.539
SMILES:
Cc1nnc(NC(=O)c2cc(sc2C)C2CC2NCC2CCOCC2)s1
: