Target
Lysine-specific histone demethylase 1A
Ligand
BDBM244001
Substrate
Meas. Tech.
LSD1 Inhibitory Assay
pH
8±n/a
Temperature
298.15±n/a K
IC50
<100.0±n/a nM
Comments
extracted
Citation
 Matsumoto, SHattori, YToyofuku, MMorimoto, SKojima, TKaku, TIto, M Cyclopropanamine compound and use thereof US Patent  US9714241 Publication Date 7/25/2017 
Target
Name:
Lysine-specific histone demethylase 1A
Synonyms:
AOF2 Flavin-containing amine oxidase domain-containing protein 2 KDM1A KIAA0601 Lysine-specific demethylase 1 (LSD1) Lysine-specific histone demethylase 1 (LSD1)
Type:
Enzyme
Mol. Mass.:
92901.01
Organism:
Homo sapiens (Human)
Description:
O60341
Residue:
852
  
Inhibitor
Name:
BDBM244001
Synonyms:
N-(1-ethyl-1H- pyrazol-4-yl)-5- ((1R,2R)-2- ((tetrahydro-2H- pyran-4-ylmethyl)- amino)cyclopropyl)- thiophene-3- carboxamide US10414761, Example 86 US9718814, 86 | US9920047, 86
Type:
Small organic molecule
Emp. Form.:
C19H26N4O2S
Mol. Mass.:
374.5
SMILES:
CCn1cc(NC(=O)c2csc(c2)[C@@H]2C[C@H]2NCC2CCOCC2)cn1
: