Target
Lysine-specific histone demethylase 1A
Ligand
BDBM244006
Substrate
Meas. Tech.
LSD1 Inhibitory Assay
pH
8±n/a
Temperature
298.15±n/a K
IC50
<100.0±n/a nM
Comments
extracted
Citation
 Matsumoto, SHattori, YToyofuku, MMorimoto, SKojima, TKaku, TIto, M Cyclopropanamine compound and use thereof US Patent  US9714241 Publication Date 7/25/2017 
Target
Name:
Lysine-specific histone demethylase 1A
Synonyms:
AOF2 Flavin-containing amine oxidase domain-containing protein 2 KDM1A KIAA0601 Lysine-specific demethylase 1 (LSD1) Lysine-specific histone demethylase 1 (LSD1)
Type:
Enzyme
Mol. Mass.:
92901.01
Organism:
Homo sapiens (Human)
Description:
O60341
Residue:
852
  
Inhibitor
Name:
BDBM244006
Synonyms:
5-((1R,2R)-2-((1- acetylpiperidin-4- yl)amino)cyclo- propyl)-N-(4,4- difluorocyclohexyl)- thiophene-3- carboxamide US10414761, Example 91 US9718814, 91 | US9920047, 91
Type:
Small organic molecule
Emp. Form.:
C21H29F2N3O2S
Mol. Mass.:
425.536
SMILES:
CC(=O)N1CCC(CC1)N[C@@H]1C[C@H]1c1cc(cs1)C(=O)NC1CCC(F)(F)CC1
: