Target
Lysine-specific histone demethylase 1A
Ligand
BDBM50153590
Substrate
Meas. Tech.
LSD1 Inhibitory Assay
pH
8±n/a
Temperature
298.15±n/a K
IC50
<100.0±n/a nM
Comments
extracted
Citation
 Matsumoto, SHattori, YToyofuku, MMorimoto, SKojima, TKaku, TIto, M Cyclopropanamine compound and use thereof US Patent  US9714241 Publication Date 7/25/2017 
Target
Name:
Lysine-specific histone demethylase 1A
Synonyms:
AOF2 Flavin-containing amine oxidase domain-containing protein 2 KDM1A KIAA0601 Lysine-specific demethylase 1 (LSD1) Lysine-specific histone demethylase 1 (LSD1)
Type:
Enzyme
Mol. Mass.:
92901.01
Organism:
Homo sapiens (Human)
Description:
O60341
Residue:
852
  
Inhibitor
Name:
BDBM50153590
Synonyms:
CHEMBL3774809 US10414761, Example 97 US9487511, 97 US9920047, 97
Type:
Small organic molecule
Emp. Form.:
C18H24N4O2S2
Mol. Mass.:
392.539
SMILES:
Cc1nnc(NC(=O)c2cc([C@@H]3C[C@H]3NCC3CCOCC3)c(C)s2)s1
: