Target
Lysine-specific histone demethylase 1A
Ligand
BDBM244016
Substrate
Meas. Tech.
LSD1 Inhibitory Assay
pH
8±n/a
Temperature
298.15±n/a K
IC50
<100.0±n/a nM
Comments
extracted
Citation
 Matsumoto, SHattori, YToyofuku, MMorimoto, SKojima, TKaku, TIto, M Cyclopropanamine compound and use thereof US Patent  US9714241 Publication Date 7/25/2017 
Target
Name:
Lysine-specific histone demethylase 1A
Synonyms:
AOF2 Flavin-containing amine oxidase domain-containing protein 2 KDM1A KIAA0601 Lysine-specific demethylase 1 (LSD1) Lysine-specific histone demethylase 1 (LSD1)
Type:
Enzyme
Mol. Mass.:
92901.01
Organism:
Homo sapiens (Human)
Description:
O60341
Residue:
852
  
Inhibitor
Name:
BDBM244016
Synonyms:
4-((4-((((1R,2R)-2- (4-((4,4-difluoro- cyclohexyl)- carbamoyl)-2- thienyl)cyclo- propyl)amino)methyl) piperidin-1- yl)methyl)benzoic acid US10414761, Example 101 US9718814, 101 | US9920047, 101
Type:
Small organic molecule
Emp. Form.:
C28H35F2N3O3S
Mol. Mass.:
531.658
SMILES:
OC(=O)c1ccc(CN2CCC(CN[C@@H]3C[C@H]3c3cc(cs3)C(=O)NC3CCC(F)(F)CC3)CC2)cc1
: