Target
Lysine-specific histone demethylase 1A
Ligand
BDBM256729
Substrate
Meas. Tech.
LSD1 Inhibitory Assay
pH
8±n/a
Temperature
298.15±n/a K
IC50
<100.0±n/a nM
Comments
extracted
Citation
 Matsumoto, SHattori, YToyofuku, MMorimoto, SKojima, TKaku, TIto, M Cyclopropanamine compound and use thereof US Patent  US9714241 Publication Date 7/25/2017 
Target
Name:
Lysine-specific histone demethylase 1A
Synonyms:
AOF2 Flavin-containing amine oxidase domain-containing protein 2 KDM1A KIAA0601 Lysine-specific demethylase 1 (LSD1) Lysine-specific histone demethylase 1 (LSD1)
Type:
Enzyme
Mol. Mass.:
92901.01
Organism:
Homo sapiens (Human)
Description:
O60341
Residue:
852
  
Inhibitor
Name:
BDBM256729
Synonyms:
US10053456, 125 US10968213, Example 125 US9718814, 125 | US9920047, 125
Type:
Small organic molecule
Emp. Form.:
C17H24N2O2S
Mol. Mass.:
320.45
SMILES:
O=C(NC1CCOCC1)c1csc(c1)[C@H]1C[C@@H]1NCC1CC1
: