Target
Sphingosine 1-phosphate receptor 1
Ligand
BDBM37275
Substrate
Meas. Tech.
Dose Response Assays for S1P1 Agonists and Agonism Potentiators - Potentiator Assay 60K MLSMR
EC50
8250±n/a nM
Citation
 PubChem, PC Dose Response Assays for S1P1 Agonists and Agonism Potentiators - Potentiator Assay 60K MLSMR PubChem Bioassay (2007)[AID] 
Target
Name:
Sphingosine 1-phosphate receptor 1
Synonyms:
CHEDG1 Endothelial differentiation G-protein coupled receptor 1 S1P1 S1PR1_HUMAN Sphingosine 1-phosphate receptor Edg-1
Type:
Enzyme
Mol. Mass.:
42836.02
Organism:
Homo sapiens (Human)
Description:
P21453
Residue:
382
  
Inhibitor
Name:
BDBM37275
Synonyms:
4-[3-(2-methylphenyl)-2H-1,2,4-oxadiazol-5-ylidene]-1-cyclohexa-2,5-dienone 4-[3-(o-tolyl)-2H-1,2,4-oxadiazol-5-ylidene]cyclohexa-2,5-dien-1-one SMR000108415 | cid_5407960
Type:
Small organic molecule
Emp. Form.:
C15H12N2O2
Mol. Mass.:
252.268
SMILES:
Cc1ccccc1-c1noc(n1)-c1ccc(O)cc1
: