Target
Sphingosine 1-phosphate receptor 1
Ligand
BDBM37115
Substrate
Meas. Tech.
Dose Response Assays for S1P1 Agonists and Agonism Potentiators - Parental Cell Line Counter Screen 60K MLSMR
EC50
>95100±n/a nM
Citation
 PubChem, PC Dose Response Assays for S1P1 Agonists and Agonism Potentiators - Parental Cell Line Counter Screen 60K MLSMR PubChem Bioassay (2007)[AID] 
Target
Name:
Sphingosine 1-phosphate receptor 1
Synonyms:
CHEDG1 Endothelial differentiation G-protein coupled receptor 1 S1P1 S1PR1_HUMAN Sphingosine 1-phosphate receptor Edg-1
Type:
Enzyme
Mol. Mass.:
42836.02
Organism:
Homo sapiens (Human)
Description:
P21453
Residue:
382
  
Inhibitor
Name:
BDBM37115
Synonyms:
4-[5-(3,4-diethoxyphenyl)-1,2,4-oxadiazol-3-yl]pyridine 5-(3,4-diethoxyphenyl)-3-pyridin-4-yl-1,2,4-oxadiazole SMR000075132 cid_976135
Type:
Small organic molecule
Emp. Form.:
C17H17N3O3
Mol. Mass.:
311.3352
SMILES:
CCOc1ccc(cc1OCC)-c1nc(no1)-c1ccncc1
: