Target
Sphingosine 1-phosphate receptor 1
Ligand
BDBM50293103
Substrate
Meas. Tech.
Dose Response Assays for S1P1 Agonists and Agonism Potentiators - Parental Cell Line Counter Screen 60K MLSMR
EC50
>95100±n/a nM
Citation
 PubChem, PC Dose Response Assays for S1P1 Agonists and Agonism Potentiators - Parental Cell Line Counter Screen 60K MLSMR PubChem Bioassay (2007)[AID] 
Target
Name:
Sphingosine 1-phosphate receptor 1
Synonyms:
CHEDG1 Endothelial differentiation G-protein coupled receptor 1 S1P1 S1PR1_HUMAN Sphingosine 1-phosphate receptor Edg-1
Type:
Enzyme
Mol. Mass.:
42836.02
Organism:
Homo sapiens (Human)
Description:
P21453
Residue:
382
  
Inhibitor
Name:
BDBM50293103
Synonyms:
5-(2-fluorophenyl)-3-(4-methoxyphenyl)-1,2,4-oxadiazole cid_925735
Type:
Small organic molecule
Emp. Form.:
C15H11FN2O2
Mol. Mass.:
270.2584
SMILES:
COc1ccc(cc1)-c1noc(n1)-c1ccccc1F
: