Target
Sphingosine 1-phosphate receptor 1
Ligand
BDBM36852
Substrate
Meas. Tech.
Dose Response Assays for S1P1 Agonists and Agonism Potentiators - Agonist Assay 60K MLSMR
EC50
9539±n/a nM
Citation
 PubChem, PC Dose Response Assays for S1P1 Agonists and Agonism Potentiators - Agonist Assay 60K MLSMR PubChem Bioassay (2007)[AID] 
Target
Name:
Sphingosine 1-phosphate receptor 1
Synonyms:
CHEDG1 Endothelial differentiation G-protein coupled receptor 1 S1P1 S1PR1_HUMAN Sphingosine 1-phosphate receptor Edg-1
Type:
Enzyme
Mol. Mass.:
42836.02
Organism:
Homo sapiens (Human)
Description:
P21453
Residue:
382
  
Inhibitor
Name:
BDBM36852
Synonyms:
MLS000073104 N-[4-(1,3-benzodioxol-5-yl)-1,3-thiazol-2-yl]pyridine-4-carboxamide N-[4-(1,3-benzodioxol-5-yl)thiazol-2-yl]isonicotinamide cid_650651
Type:
Small organic molecule
Emp. Form.:
C16H11N3O3S
Mol. Mass.:
325.342
SMILES:
O=C(Nc1nc(cs1)-c1ccc2OCOc2c1)c1ccncc1
: