Target
Sphingosine 1-phosphate receptor 1
Ligand
BDBM36871
Substrate
Meas. Tech.
Dose Response Assays for S1P1 Agonists and Agonism Potentiators - Agonist Assay 60K MLSMR
EC50
11830±n/a nM
Citation
 PubChem, PC Dose Response Assays for S1P1 Agonists and Agonism Potentiators - Agonist Assay 60K MLSMR PubChem Bioassay (2007)[AID] 
Target
Name:
Sphingosine 1-phosphate receptor 1
Synonyms:
CHEDG1 Endothelial differentiation G-protein coupled receptor 1 S1P1 S1PR1_HUMAN Sphingosine 1-phosphate receptor Edg-1
Type:
Enzyme
Mol. Mass.:
42836.02
Organism:
Homo sapiens (Human)
Description:
P21453
Residue:
382
  
Inhibitor
Name:
BDBM36871
Synonyms:
MLS000027766 N-[4-(1-mesyl-2-methyl-indolin-5-yl)thiazol-2-yl]-2-(2-thienyl)acetamide N-[4-(2-methyl-1-methylsulfonyl-2,3-dihydroindol-5-yl)-1,3-thiazol-2-yl]-2-thiophen-2-ylacetamide SMR000007522 | cid_654842
Type:
Small organic molecule
Emp. Form.:
C19H19N3O3S3
Mol. Mass.:
433.567
SMILES:
CC1Cc2cc(ccc2N1S(C)(=O)=O)-c1csc(NC(=O)Cc2cccs2)n1
: