Target
fMet-Leu-Phe receptor
Ligand
BDBM33622
Substrate
Meas. Tech.
Dose Response Assay for Formylpeptide Receptor (FPR) Ligands and Dose Response Counter-Screen Assay for Formylpeptide-Like-1 (FPRL1) Ligands
IC50
>66700±n/a nM
Citation
 PubChem, PC Dose Response Assay for Formylpeptide Receptor (FPR) Ligands and Dose Response Counter-Screen Assay for Formylpeptide-Like-1 (FPRL1) Ligands PubChem Bioassay (2007)[AID] 
Target
Name:
fMet-Leu-Phe receptor
Synonyms:
FPR FPR1_HUMAN N-formyl peptide receptor 1 fMLP receptor formyl peptide receptor 1
Type:
Enzyme Catalytic Domain
Mol. Mass.:
38456.14
Organism:
Homo sapiens (Human)
Description:
gi_4503779
Residue:
350
  
Inhibitor
Name:
BDBM33622
Synonyms:
2-[(5Z)-4-keto-5-(2-keto-1-methyl-indolin-3-ylidene)-2-thioxo-thiazolidin-3-yl]glutaric acid 2-[(5Z)-5-(1-methyl-2-oxo-3-indolylidene)-4-oxo-2-sulfanylidene-3-thiazolidinyl]pentanedioic acid MLS000105064 cid_2769925
Type:
Small organic molecule
Emp. Form.:
C17H14N2O6S2
Mol. Mass.:
406.433
SMILES:
CN1C(=O)\C(=C2/SC(=S)N(C(CCC(O)=O)C(O)=O)C2=O)c2ccccc12
: