Target
N-formyl peptide receptor 2
Ligand
BDBM37728
Substrate
Meas. Tech.
Dose Response Assay for Formylpeptide Receptor-Like-1 (FPRL1) Ligands and Dose Response Counter-Screen Assay for Formylpeptide Receptor (FPR) Ligands
Ki
>40300±n/a nM
Comments
Extracted from aid = 520 and tid = 2
Citation
 PubChem, PC Dose Response Assay for Formylpeptide Receptor-Like-1 (FPRL1) Ligands and Dose Response Counter-Screen Assay for Formylpeptide Receptor (FPR) Ligands PubChem Bioassay (2007)[AID] 
Target
Name:
N-formyl peptide receptor 2
Synonyms:
ALXR, FPRL1, FPR2 FPR2 FPRH1 Formyl Peptide Receptor-Like 1 LXA4 receptor Lipoxin A4 receptor RFP | hFPRL
Type:
G Protein-Coupled Receptor (GPCR)
Mol. Mass.:
38968.35
Organism:
Homo sapiens (Human)
Description:
P25090
Residue:
351
  
Inhibitor
Name:
BDBM37728
Synonyms:
2-[[3,5-bis(isopropoxycarbonyl)phenyl]carbamoyl]-7-oxabicyclo[2.2.1]heptane-3-carboxylic acid 2-[[3,5-bis[oxo(propan-2-yloxy)methyl]anilino]-oxomethyl]-7-oxabicyclo[2.2.1]heptane-3-carboxylic acid MLS000085405 cid_3242292
Type:
Small organic molecule
Emp. Form.:
C22H27NO8
Mol. Mass.:
433.4517
SMILES:
[H]C12CCC([H])(O1)C(C2C(O)=O)C(=O)Nc1cc(cc(c1)C(=O)OC(C)C)C(=O)OC(C)C
: