Target
N-formyl peptide receptor 2
Ligand
BDBM33622
Substrate
Meas. Tech.
Dose Response Assay for Formylpeptide Receptor-Like-1 (FPRL1) Ligands and Dose Response Counter-Screen Assay for Formylpeptide Receptor (FPR) Ligands
Ki
>40300±n/a nM
Comments
Extracted from aid = 520 and tid = 2
Citation
 PubChem, PC Dose Response Assay for Formylpeptide Receptor-Like-1 (FPRL1) Ligands and Dose Response Counter-Screen Assay for Formylpeptide Receptor (FPR) Ligands PubChem Bioassay (2007)[AID] 
Target
Name:
N-formyl peptide receptor 2
Synonyms:
ALXR, FPRL1, FPR2 FPR2 FPRH1 Formyl Peptide Receptor-Like 1 LXA4 receptor Lipoxin A4 receptor RFP | hFPRL
Type:
G Protein-Coupled Receptor (GPCR)
Mol. Mass.:
38968.35
Organism:
Homo sapiens (Human)
Description:
P25090
Residue:
351
  
Inhibitor
Name:
BDBM33622
Synonyms:
2-[(5Z)-4-keto-5-(2-keto-1-methyl-indolin-3-ylidene)-2-thioxo-thiazolidin-3-yl]glutaric acid 2-[(5Z)-5-(1-methyl-2-oxo-3-indolylidene)-4-oxo-2-sulfanylidene-3-thiazolidinyl]pentanedioic acid MLS000105064 cid_2769925
Type:
Small organic molecule
Emp. Form.:
C17H14N2O6S2
Mol. Mass.:
406.433
SMILES:
CN1C(=O)\C(=C2/SC(=S)N(C(CCC(O)=O)C(O)=O)C2=O)c2ccccc12
: