Target
Mevalonate kinase
Ligand
BDBM34471
Substrate
Meas. Tech.
Screening for Inhibitors of the Mevalonate Pathway in Streptococcus Pneumoniae - MK Dose Response
IC50
11338.1±n/a nM
Citation
 PubChem, PC Screening for Inhibitors of the Mevalonate Pathway in Streptococcus Pneumoniae - MK Dose Response PubChem Bioassay (2007)[AID] 
Target
Name:
Mevalonate kinase
Synonyms:
Type:
Enzyme Catalytic Domain
Mol. Mass.:
31420.64
Organism:
Streptococcus pneumoniae D39
Description:
A0A0H2ZQX9
Residue:
292
  
Inhibitor
Name:
BDBM34471
Synonyms:
4-(2,5-dimethoxyphenyl)-3-(3-hydroxyphenyl)-1H-1,2,4-triazole-5-thione MLS000089016 cid_892621
Type:
Small organic molecule
Emp. Form.:
C16H15N3O3S
Mol. Mass.:
329.374
SMILES:
COc1ccc(OC)c(c1)-n1c(n[nH]c1=S)-c1cccc(O)c1
: