Target
Mevalonate kinase
Ligand
BDBM38664
Substrate
Meas. Tech.
Screening for Inhibitors of the Mevalonate Pathway in Streptococcus Pneumoniae - MK Dose Response
IC50
>9999000±n/a nM
Citation
 PubChem, PC Screening for Inhibitors of the Mevalonate Pathway in Streptococcus Pneumoniae - MK Dose Response PubChem Bioassay (2007)[AID] 
Target
Name:
Mevalonate kinase
Synonyms:
Type:
Enzyme Catalytic Domain
Mol. Mass.:
31420.64
Organism:
Streptococcus pneumoniae D39
Description:
A0A0H2ZQX9
Residue:
292
  
Inhibitor
Name:
BDBM38664
Synonyms:
2-[(3-chlorobenzyl)(propyl)amino]ethanol 2-[(3-chlorophenyl)methyl-propyl-amino]ethanol MLS000061136 cid_783033
Type:
Small organic molecule
Emp. Form.:
C12H18ClNO
Mol. Mass.:
227.73
SMILES:
CCCN(CCO)Cc1cccc(Cl)c1
: