Target
Mevalonate kinase
Ligand
BDBM34336
Substrate
Meas. Tech.
Screening for Inhibitors of the Mevalonate Pathway in Streptococcus Pneumoniae - MK Dose Response
IC50
1781.3±n/a nM
Citation
 PubChem, PC Screening for Inhibitors of the Mevalonate Pathway in Streptococcus Pneumoniae - MK Dose Response PubChem Bioassay (2007)[AID] 
Target
Name:
Mevalonate kinase
Synonyms:
Type:
Enzyme Catalytic Domain
Mol. Mass.:
31420.64
Organism:
Streptococcus pneumoniae D39
Description:
A0A0H2ZQX9
Residue:
292
  
Inhibitor
Name:
BDBM34336
Synonyms:
2-(2-morpholin-4-yl-5-morpholin-4-ylsulfonyl-phenyl)-1,2-benzothiazol-3-one 2-(2-morpholino-5-morpholinosulfonyl-phenyl)-1,2-benzothiazol-3-one MLS000055722 cid_2325815
Type:
Small organic molecule
Emp. Form.:
C21H23N3O5S2
Mol. Mass.:
461.554
SMILES:
O=c1n(sc2ccccc12)-c1cc(ccc1N1CCOCC1)S(=O)(=O)N1CCOCC1
: