Target
Isoform 2 of Nuclear receptor ROR-alpha (Alpha-2)
Ligand
BDBM38902
Substrate
Meas. Tech.
Counterscreen for inhibitors of the nuclear receptor Steroidogenic Factor 1 (SF-1): A cell-based dose-response assay for inhibition of the RAR-related orphan receptor A (RORA)
IC50
8627±n/a nM
Citation
 PubChem, PC Counterscreen for inhibitors of the nuclear receptor Steroidogenic Factor 1 (SF-1): A cell-based dose-response assay for inhibition of the RAR-related orphan receptor A (RORA) PubChem Bioassay (2007)[AID] 
Target
Name:
Isoform 2 of Nuclear receptor ROR-alpha (Alpha-2)
Synonyms:
NR1F1 Nuclear receptor ROR-alpha (Alpha-2) RORA RZRA
Type:
PROTEIN
Mol. Mass.:
63033.59
Organism:
Homo sapiens (Human)
Description:
EBI_101591
Residue:
556
  
Inhibitor
Name:
BDBM38902
Synonyms:
4-(4-phenyl-1-piperazinyl)-2-(2-pyridinyl)quinazoline 4-(4-phenylpiperazin-1-yl)-2-pyridin-2-ylquinazoline MLS000036745 cid_661691
Type:
Small organic molecule
Emp. Form.:
C23H21N5
Mol. Mass.:
367.4463
SMILES:
C1CN(CCN1c1ccccc1)c1nc(nc2ccccc12)-c1ccccn1
: