Target
Steroidogenic factor 1
Ligand
BDBM38902
Substrate
Meas. Tech.
Dose-response cell-based assay for inhibitors of the nuclear receptor Steroidogenic Factor 1 (SF-1)
IC50
5649±n/a nM
Citation
 PubChem, PC Dose-response cell-based assay for inhibitors of the nuclear receptor Steroidogenic Factor 1 (SF-1) PubChem Bioassay (2007)[AID] 
Target
Name:
Steroidogenic factor 1
Synonyms:
AD4BP FTZF1 NR5A1 SF-1 STF-1 Steroid hormone receptor Ad4BP
Type:
Nuclear Hormone Receptor
Mol. Mass.:
51643.43
Organism:
Homo sapiens (Human)
Description:
Residue:
461
  
Inhibitor
Name:
BDBM38902
Synonyms:
4-(4-phenyl-1-piperazinyl)-2-(2-pyridinyl)quinazoline 4-(4-phenylpiperazin-1-yl)-2-pyridin-2-ylquinazoline MLS000036745 cid_661691
Type:
Small organic molecule
Emp. Form.:
C23H21N5
Mol. Mass.:
367.4463
SMILES:
C1CN(CCN1c1ccccc1)c1nc(nc2ccccc12)-c1ccccn1
: