Target
Steroidogenic factor 1
Ligand
BDBM38903
Substrate
Meas. Tech.
Dose-response cell-based assay for inhibitors of the nuclear receptor Steroidogenic Factor 1 (SF-1)
IC50
3210±n/a nM
Citation
 PubChem, PC Dose-response cell-based assay for inhibitors of the nuclear receptor Steroidogenic Factor 1 (SF-1) PubChem Bioassay (2007)[AID] 
Target
Name:
Steroidogenic factor 1
Synonyms:
AD4BP FTZF1 NR5A1 SF-1 STF-1 Steroid hormone receptor Ad4BP
Type:
Nuclear Hormone Receptor
Mol. Mass.:
51643.43
Organism:
Homo sapiens (Human)
Description:
Residue:
461
  
Inhibitor
Name:
BDBM38903
Synonyms:
6-(4-ethylphenyl)-2,3-dimethyl-imidazo[1,2-b][1,2,4]triazine MLS000036814 cid_661897
Type:
Small organic molecule
Emp. Form.:
C15H16N4
Mol. Mass.:
252.3143
SMILES:
CCc1ccc(cc1)-c1cn2nc(C)c(C)nc2n1
: