Target
M-phase inducer phosphatase 2
Ligand
BDBM32133
Substrate
Meas. Tech.
Cdc25B Catalytic Domain Protein Tyrosine Phosphatase Probe Assessment Dose Response assay in the presence of Glutathione.
IC50
>50000±n/a nM
Citation
 PubChem, PC Cdc25B Catalytic Domain Protein Tyrosine Phosphatase Probe Assessment Dose Response assay in the presence of Glutathione. PubChem Bioassay (2007)[AID] 
Target
Name:
M-phase inducer phosphatase 2
Synonyms:
CDC25B Dual specificity phosphatase (CDC25B) M-phase inducer phosphatase 2 (CDC25B) | MPIP2_HUMAN
Type:
Protein
Mol. Mass.:
64985.27
Organism:
Homo sapiens (Human)
Description:
Residue:
580
  
Inhibitor
Name:
BDBM32133
Synonyms:
2-(1,5-dimethyl-3-oxidanylidene-2-phenyl-pyrazol-4-yl)iminoindene-1,3-dione 2-[(1,5-dimethyl-3-oxo-2-phenyl-4-pyrazolyl)imino]indene-1,3-dione MLS000105950 cid_767530
Type:
Small organic molecule
Emp. Form.:
C20H15N3O3
Mol. Mass.:
345.3514
SMILES:
Cc1c(N=c2c(=O)c3ccccc3c2=O)c(=O)n(-c2ccccc2)n1C
: