Target
Dual specificity protein phosphatase 6
Ligand
BDBM32133
Substrate
Meas. Tech.
Cdc25B Catalytic Domain Protein Tyrosine Phosphatase Probe Assessment: MKP-3 Dose Response Selectivity comparison.
IC50
19774±n/a nM
Citation
 PubChem, PC Cdc25B Catalytic Domain Protein Tyrosine Phosphatase Probe Assessment: MKP-3 Dose Response Selectivity comparison. PubChem Bioassay (2007)[AID] 
Target
Name:
Dual specificity protein phosphatase 6
Synonyms:
DUS6_RAT MAP kinase phosphatase 3 Mitogen-activated protein kinase phosphatase 3 | Mkp3
Type:
Enzyme
Mol. Mass.:
42303.19
Organism:
Rattus norvegicus
Description:
gi_16758752
Residue:
381
  
Inhibitor
Name:
BDBM32133
Synonyms:
2-(1,5-dimethyl-3-oxidanylidene-2-phenyl-pyrazol-4-yl)iminoindene-1,3-dione 2-[(1,5-dimethyl-3-oxo-2-phenyl-4-pyrazolyl)imino]indene-1,3-dione MLS000105950 cid_767530
Type:
Small organic molecule
Emp. Form.:
C20H15N3O3
Mol. Mass.:
345.3514
SMILES:
Cc1c(N=c2c(=O)c3ccccc3c2=O)c(=O)n(-c2ccccc2)n1C
: