Target
Steroidogenic factor 1
Ligand
BDBM39474
Substrate
Meas. Tech.
Dose-response cell-based assay for activators of the nuclear receptor Steroidogenic Factor 1 (SF-1)
EC50
1010±n/a nM
Citation
 PubChem, PC Dose-response cell-based assay for activators of the nuclear receptor Steroidogenic Factor 1 (SF-1) PubChem Bioassay (2007)[AID] 
Target
Name:
Steroidogenic factor 1
Synonyms:
AD4BP FTZF1 NR5A1 SF-1 STF-1 Steroid hormone receptor Ad4BP
Type:
Nuclear Hormone Receptor
Mol. Mass.:
51643.43
Organism:
Homo sapiens (Human)
Description:
Residue:
461
  
Inhibitor
Name:
BDBM39474
Synonyms:
(6-fluoro-1,3-benzothiazol-2-yl)-(4,5,6,7-tetrahydro-1,3-benzothiazol-2-yl)amine 6-fluoro-N-(4,5,6,7-tetrahydro-1,3-benzothiazol-2-yl)-1,3-benzothiazol-2-amine MLS000045471 cid_3240665
Type:
Small organic molecule
Emp. Form.:
C14H12FN3S2
Mol. Mass.:
305.394
SMILES:
Fc1ccc2nc(Nc3nc4CCCCc4s3)sc2c1
: