Target
Estrogen receptor
Ligand
BDBM40051
Substrate
Meas. Tech.
Estrogen Receptor-alpha Coactivator Binding Inhibitors Dose Response Confirmation
IC50
6261.99±n/a nM
Citation
 PubChem, PC Estrogen Receptor-alpha Coactivator Binding Inhibitors Dose Response Confirmation PubChem Bioassay (2007)[AID] 
Target
Name:
Estrogen receptor
Synonyms:
ER ESR ESR1_HUMAN Estrogen receptor Estrogen receptor (ER-alpha) Estrogen receptor alpha (ER) Nuclear receptor subfamily 3 group A member 1
Type:
Protein
Mol. Mass.:
66230.44
Organism:
Homo sapiens (Human)
Description:
P03372
Residue:
595
  
Inhibitor
Name:
BDBM40051
Synonyms:
9-(3-chlorophenyl)-2-(3,4-dimethoxyphenyl)-8-keto-7H-purine-6-carboxamide 9-(3-chlorophenyl)-2-(3,4-dimethoxyphenyl)-8-oxo-7H-purine-6-carboxamide MLS000094131 cid_3245989
Type:
Small organic molecule
Emp. Form.:
C20H16ClN5O4
Mol. Mass.:
425.825
SMILES:
COc1ccc(cc1OC)-c1nc(C(N)=O)c2[nH]c(=O)n(-c3cccc(Cl)c3)c2n1
: