Target
Ubiquitin carboxyl-terminal hydrolase BAP1
Ligand
BDBM40278
Substrate
Meas. Tech.
BAP1 Enzyme inhibitors Dose Response Confirmation
IC50
>50000±n/a nM
Citation
 PubChem, PC BAP1 Enzyme inhibitors Dose Response Confirmation PubChem Bioassay (2007)[AID] 
Target
Name:
Ubiquitin carboxyl-terminal hydrolase BAP1
Synonyms:
BAP1 KIAA0272 | Ubiquitin carboxyl-terminal hydrolase BAP1 (BRCA1-associated protein 1) (Cerebral protein 6).
Type:
Enzyme Catalytic Domain
Mol. Mass.:
80364.15
Organism:
Homo sapiens (Human)
Description:
gi_68565074
Residue:
729
  
Inhibitor
Name:
BDBM40278
Synonyms:
2-[5-(4-Chloro-phenoxymethyl)-4-methyl-4H-[1,2,4]triazol-3-ylsulfanyl]-N-(3-cyano-4,5-dimethyl-thiophen-2-yl)-acetamide 2-[[5-[(4-chlorophenoxy)methyl]-4-methyl-1,2,4-triazol-3-yl]sulfanyl]-N-(3-cyano-4,5-dimethylthiophen-2-yl)acetamide 2-[[5-[(4-chlorophenoxy)methyl]-4-methyl-1,2,4-triazol-3-yl]thio]-N-(3-cyano-4,5-dimethyl-2-thiophenyl)acetamide SMR000001998 | cid_651987
Type:
Small organic molecule
Emp. Form.:
C19H18ClN5O2S2
Mol. Mass.:
447.962
SMILES:
Cc1sc(NC(=O)CSc2nnc(COc3ccc(Cl)cc3)n2C)c(C#N)c1C
: