Target
Sphingosine 1-phosphate receptor 3
Ligand
BDBM31007
Substrate
Meas. Tech.
S1P3 Dose Response Assay Counterscreen for 5-Hydroxytryptamine(Serotonin) Receptor Subtype 1E Agonists
EC50
>40000±n/a nM
Citation
 PubChem, PC S1P3 Dose Response Assay Counterscreen for 5-Hydroxytryptamine(Serotonin) Receptor Subtype 1E Agonists PubChem Bioassay (2007)[AID] 
Target
Name:
Sphingosine 1-phosphate receptor 3
Synonyms:
C9orf108 EDG3 S1P receptor 3 S1P3 S1PR3_HUMAN Sphingosine 1-phosphate receptor 3 (S1P3) | Sphingosine 1-phosphate receptor Edg-3
Type:
G Protein-Coupled Receptor (GPCR)
Mol. Mass.:
42278.13
Organism:
Homo sapiens (Human)
Description:
Q99500
Residue:
378
  
Inhibitor
Name:
BDBM31007
Synonyms:
1-(diethylamino)-7-methyl-3-(4-morpholinyl)-6,8-dihydro-5H-2,7-naphthyridine-4-carbonitrile 1-(diethylamino)-7-methyl-3-morpholino-6,8-dihydro-5H-2,7-naphthyridine-4-carbonitrile SMR000037346 | cid_659395
Type:
Small organic molecule
Emp. Form.:
C18H27N5O
Mol. Mass.:
329.4399
SMILES:
CCN(CC)c1nc(N2CCOCC2)c(C#N)c2CCN(C)Cc12
: