Target
Heat shock 70 kDa protein 1A
Ligand
BDBM31703
Substrate
Meas. Tech.
TR-FRET secondary assay for HTS discovery of chemical inhibitors of Hsp70
IC50
18500±1750 nM
Citation
 PubChem, PC TR-FRET secondary assay for HTS discovery of chemical inhibitors of Hsp70 PubChem Bioassay (2008)[AID] 
Target
Name:
Heat shock 70 kDa protein 1A
Synonyms:
HSPA1A V9GZ37_HUMAN | heat shock 70kDa protein 1A
Type:
ATP-binding protein
Mol. Mass.:
51937.99
Organism:
Homo sapiens (Human)
Description:
gi_123271505; GST-tagged ATPase domain
Residue:
476
  
Inhibitor
Name:
BDBM31703
Synonyms:
3-(2,5-dimethyl-1-pyrrolyl)benzoic acid 3-(2,5-dimethylpyrrol-1-yl)benzoic acid SMR000068999 | cid_213329
Type:
Small organic molecule
Emp. Form.:
C13H13NO2
Mol. Mass.:
215.2478
SMILES:
Cc1ccc(C)n1-c1cccc(c1)C(O)=O
: