Target
Focal adhesion kinase 1
Ligand
BDBM40953
Substrate
Meas. Tech.
Dose-response biochemical assay for inhibitors of Focal Adhesion Kinase (FAK)
IC50
2699±n/a nM
Citation
 PubChem, PC Dose-response biochemical assay for inhibitors of Focal Adhesion Kinase (FAK) PubChem Bioassay (2007)[AID] 
Target
Name:
Focal adhesion kinase 1
Synonyms:
FADK 1 FAK1 FLT4 Focal adhesion kinase (FAK) Focal adhesion kinase 1 (FAK) Focal adhesion kinase-related nonkinase PTK2 Protein-tyrosine kinase 2 p125FAK | pp125FAK
Type:
Tyrosine-protein kinase
Mol. Mass.:
119233.17
Organism:
Homo sapiens (Human)
Description:
Q05397
Residue:
1052
  
Inhibitor
Name:
BDBM40953
Synonyms:
(2-carbophenoxy-3-chloro-phenyl)phosphonic acid (3-chloro-2-phenoxycarbonylphenyl)phosphonic acid SMR000040984 cid_659999
Type:
Small organic molecule
Emp. Form.:
C13H10ClO5P
Mol. Mass.:
312.642
SMILES:
OP(O)(=O)c1cccc(Cl)c1C(=O)Oc1ccccc1
: