Target
Focal adhesion kinase 1
Ligand
BDBM40551
Substrate
Meas. Tech.
Dose-response biochemical assay for inhibitors of Focal Adhesion Kinase (FAK)
IC50
5242±n/a nM
Citation
 PubChem, PC Dose-response biochemical assay for inhibitors of Focal Adhesion Kinase (FAK) PubChem Bioassay (2007)[AID] 
Target
Name:
Focal adhesion kinase 1
Synonyms:
FADK 1 FAK1 FLT4 Focal adhesion kinase (FAK) Focal adhesion kinase 1 (FAK) Focal adhesion kinase-related nonkinase PTK2 Protein-tyrosine kinase 2 p125FAK | pp125FAK
Type:
Tyrosine-protein kinase
Mol. Mass.:
119233.17
Organism:
Homo sapiens (Human)
Description:
Q05397
Residue:
1052
  
Inhibitor
Name:
BDBM40551
Synonyms:
2-(1H-quinolin-4-ylidene)indane-1,3-quinone 2-(4-quinolyl)indane-1,3-quinone MLS000122777 cid_5765327
Type:
Small organic molecule
Emp. Form.:
C18H11NO2
Mol. Mass.:
273.2854
SMILES:
O=C1C(C(=O)c2ccccc12)c1ccnc2ccccc12
: