Target
Complement C1s subcomponent
Ligand
BDBM32761
Substrate
Meas. Tech.
Complement C1s ELISA
IC50
>50000±n/a nM
Citation
 PubChem, PC Complement C1s ELISA PubChem Bioassay (2008)[AID] 
Target
Name:
Complement C1s subcomponent
Synonyms:
C1 esterase C1S_HUMAN Complement C1s subcomponent Complement C1s subcomponent light chain Trypsin | complement component 1, s subcomponent
Type:
Protein
Mol. Mass.:
76657.91
Organism:
Homo sapiens (Human)
Description:
P09871
Residue:
688
  
Inhibitor
Name:
BDBM32761
Synonyms:
2-furancarboxylic acid [5-amino-1-(4-methoxyphenyl)sulfonyl-3-pyrazolyl] ester MLS000033887 US11584714, Compound 40# [5-azanyl-1-(4-methoxyphenyl)sulfonyl-pyrazol-3-yl] furan-2-carboxylate furan-2-carboxylic acid [5-amino-1-(4-methoxyphenyl)sulfonyl-pyrazol-3-yl] ester
Type:
Small organic molecule
Emp. Form.:
C15H13N3O6S
Mol. Mass.:
363.345
SMILES:
COc1ccc(cc1)S(=O)(=O)n1nc(OC(=O)c2ccco2)cc1N
: