Target
Cathepsin S
Ligand
BDBM41311
Substrate
Meas. Tech.
Cathepsin S dose-response confirmation
IC50
>50000±0 nM
Citation
 PubChem, PC Cathepsin S dose-response confirmation PubChem Bioassay (2008)[AID] 
Target
Name:
Cathepsin S
Synonyms:
CATS_HUMAN Cathepsin S (Cat S) | cathepsin S preproprotein
Type:
Protein
Mol. Mass.:
37507.38
Organism:
Homo sapiens (Human)
Description:
P25774
Residue:
331
  
Inhibitor
Name:
BDBM41311
Synonyms:
(5-phenyl-1,3,4-oxadiazol-2-yl)methyl 4-acetyl-3,5-dimethyl-1H-pyrrole-2-carboxylate 4-acetyl-3,5-dimethyl-1H-pyrrole-2-carboxylic acid (5-phenyl-1,3,4-oxadiazol-2-yl)methyl ester SMR000067278 | cid_2081549
Type:
Small organic molecule
Emp. Form.:
C18H17N3O4
Mol. Mass.:
339.3453
SMILES:
CC(=O)c1c(C)[nH]c(C(=O)OCc2nnc(o2)-c2ccccc2)c1C
: