Target
Serine/threonine-protein kinase PLK1
Ligand
BDBM41766
Substrate
Meas. Tech.
Concentration Response Redox Cycling H2O2 Generation assay to characterize small molecule inhibitors identified in the Polo box domain (PBD) of Plk1 Primary HTS.
EC50
>50000±n/a nM
Citation
 PubChem, PC Concentration Response Redox Cycling H2O2 Generation assay to characterize small molecule inhibitors identified in the Polo box domain (PBD) of Plk1 Primary HTS. PubChem Bioassay (2007)[AID] 
Target
Name:
Serine/threonine-protein kinase PLK1
Synonyms:
PLK PLK1 Polo-like kinase 1 (PlK1) STPK13 Serine/threonine-protein kinase 13 | polo-like kinase
Type:
Serine/threonine-protein kinase
Mol. Mass.:
68277.16
Organism:
Homo sapiens (Human)
Description:
P53350
Residue:
603
  
Inhibitor
Name:
BDBM41766
Synonyms:
MLS000040678 N-[1-(cyclohexylmethyl)-2,5-diketo-4-(trifluoromethyl)imidazolidin-4-yl]-2-furamide N-[1-(cyclohexylmethyl)-2,5-dioxo-4-(trifluoromethyl)imidazolidin-4-yl]furan-2-carboxamide cid_663976
Type:
Small organic molecule
Emp. Form.:
C16H18F3N3O4
Mol. Mass.:
373.327
SMILES:
FC(F)(F)C1(NC(=O)c2ccco2)NC(=O)N(CC2CCCCC2)C1=O
: