Target
Nuclear receptor subfamily 4 group A member 1
Ligand
BDBM42096
Substrate
Meas. Tech.
Fluorescence Polarization Dose Response Assay for TR3-Based Bcl-B Inhibitors
EC50
9070±3620 nM
Citation
 PubChem, PC Fluorescence Polarization Dose Response Assay for TR3-Based Bcl-B Inhibitors PubChem Bioassay (2008)[AID] 
Target
Name:
Nuclear receptor subfamily 4 group A member 1
Synonyms:
GFRP1 NAK1 NR4A1_HUMAN | nuclear receptor subfamily 4, group A, member 1
Type:
Enzyme Catalytic Domain
Mol. Mass.:
64467.13
Organism:
Homo sapiens (Human)
Description:
gi_27894344
Residue:
598
  
Inhibitor
Name:
BDBM42096
Synonyms:
3-[(E)-[2-(2-furanyl)-3-imidazo[1,2-a]pyridinyl]iminomethyl]phenol 3-[(E)-[2-(furan-2-yl)imidazo[1,2-a]pyridin-3-yl]iminomethyl]phenol cid_9556421
Type:
Small organic molecule
Emp. Form.:
C18H13N3O2
Mol. Mass.:
303.3147
SMILES:
Oc1cccc(\C=N\c2c(nc3ccccn23)-c2ccco2)c1
: