Target
Tyrosine-protein phosphatase YopH
Ligand
BDBM42216
Substrate
Meas. Tech.
YopH - IC50 determinations (10 point dose range)
IC50
>50000±n/a nM
Citation
 PubChem, PC YopH - IC50 determinations (10 point dose range) PubChem Bioassay (2008)[AID] 
Target
Name:
Tyrosine-protein phosphatase YopH
Synonyms:
YOPH_YEREN yopH
Type:
PROTEIN
Mol. Mass.:
50951.99
Organism:
Yersinia enterocolitica
Description:
ChEMBL_965525
Residue:
468
  
Inhibitor
Name:
BDBM42216
Synonyms:
3-(4-fluoroanilino)-2H-isoquinolin-1-one 3-[(4-fluorophenyl)amino]-2H-isoquinolin-1-one SMR000152650 | cid_2323972
Type:
Small organic molecule
Emp. Form.:
C15H11FN2O
Mol. Mass.:
254.259
SMILES:
Fc1ccc(Nc2cc3ccccc3c(=O)[nH]2)cc1
: