Target
E3 ubiquitin-protein ligase XIAP
Ligand
BDBM44351
Substrate
Meas. Tech.
SAR analysis of Antagonists of XIAP-Bir3 domain of IAP-family anti-apoptotic proteins
IC50
1000±100 nM
Citation
 PubChem, PC SAR analysis of Antagonists of XIAP-Bir3 domain of IAP-family anti-apoptotic proteins PubChem Bioassay (2009)[AID] 
Target
Name:
E3 ubiquitin-protein ligase XIAP
Synonyms:
API3 E3 ubiquitin-protein ligase XIAP Inhibitor of apoptosis protein 3 X-linked inhibitor of apoptosis XIAP | XIAP_HUMAN
Type:
Protein
Mol. Mass.:
56685.27
Organism:
Homo sapiens (Human)
Description:
P98170
Residue:
497
  
Inhibitor
Name:
BDBM44351
Synonyms:
(2S)-6-amino-2-[[(2S)-3-methyl-2-[[(2S)-2-(methylamino)-1-oxopropyl]amino]-1-oxobutyl]amino]-N-(1,2,3,4-tetrahydronaphthalen-1-yl)hexanamide;formic acid (2S)-6-amino-2-[[(2S)-3-methyl-2-[[(2S)-2-(methylamino)propanoyl]amino]butanoyl]amino]-N-tetralin-1-yl-hexanamide;formic acid MLS-0425207.0001 | cid_44229032
Type:
Small organic molecule
Emp. Form.:
C25H41N5O3
Mol. Mass.:
459.6247
SMILES:
CN[C@@H](C)C(=O)N[C@@H](C(C)C)C(=O)N[C@@H](CCCCN)C(=O)NC1CCCc2ccccc12
: