Target
Alkaline phosphatase, tissue-nonspecific isozyme
Ligand
BDBM46037
Substrate
Meas. Tech.
SAR analysis of an In Vitro TNAP Dose Response Luminescent Assay
IC50
>100000±n/a nM
Citation
 PubChem, PC SAR analysis of an In Vitro TNAP Dose Response Luminescent Assay PubChem Bioassay (2010)[AID] 
Target
Name:
Alkaline phosphatase, tissue-nonspecific isozyme
Synonyms:
ALPL tissue-nonspecific alkaline phosphatase precursor
Type:
PROTEIN
Mol. Mass.:
57306.17
Organism:
Homo sapiens (Human)
Description:
ChEMBL_1448917
Residue:
524
  
Inhibitor
Name:
BDBM46037
Synonyms:
MLS-0315805.0001 N,N-diethyl-3-(3-oxidanylidene-1,2-benzothiazol-2-yl)benzenesulfonamide cid_2381612
Type:
Small organic molecule
Emp. Form.:
C17H18N2O3S2
Mol. Mass.:
362.466
SMILES:
CCN(CC)S(=O)(=O)c1cccc(c1)-n1sc2ccccc2c1=O
: