Target
Alkaline phosphatase, tissue-nonspecific isozyme
Ligand
BDBM46061
Substrate
Meas. Tech.
SAR analysis of an In Vitro TNAP Dose Response Luminescent Assay
IC50
>100000±n/a nM
Citation
 PubChem, PC SAR analysis of an In Vitro TNAP Dose Response Luminescent Assay PubChem Bioassay (2010)[AID] 
Target
Name:
Alkaline phosphatase, tissue-nonspecific isozyme
Synonyms:
ALPL tissue-nonspecific alkaline phosphatase precursor
Type:
PROTEIN
Mol. Mass.:
57306.17
Organism:
Homo sapiens (Human)
Description:
ChEMBL_1448917
Residue:
524
  
Inhibitor
Name:
BDBM46061
Synonyms:
1-(3,4-dihydroxyphenyl)-2-[(4-methyl-5-thiophen-2-yl-1,2,4-triazol-3-yl)sulfanyl]ethanone 1-(3,4-dihydroxyphenyl)-2-[[4-methyl-5-(2-thienyl)-1,2,4-triazol-3-yl]thio]ethanone MLS-0297827.0001 | cid_3735808
Type:
Small organic molecule
Emp. Form.:
C15H13N3O3S2
Mol. Mass.:
347.412
SMILES:
Cn1c(SCC(=O)c2ccc(O)c(O)c2)nnc1-c1cccs1
: