Target
Tyrosine-protein phosphatase non-receptor type 7
Ligand
BDBM46277
Substrate
Meas. Tech.
Fluorescent secondary assay for dose-response confirmation of chemical inhibitors of HePTP
IC50
>100000±n/a nM
Citation
 PubChem, PC Fluorescent secondary assay for dose-response confirmation of chemical inhibitors of HePTP PubChem Bioassay (2009)[AID] 
Target
Name:
Tyrosine-protein phosphatase non-receptor type 7
Synonyms:
He-PTP Hematopoietic protein-tyrosine phosphatase (HEPTP) PTPN7 Tyrosine-protein phosphatase non-receptor type 7 | Tyrosine-protein phosphatase non-receptor type 7 (HEPTP)
Type:
Protein
Mol. Mass.:
40530.79
Organism:
Homo sapiens (Human)
Description:
P35236
Residue:
360
  
Inhibitor
Name:
BDBM46277
Synonyms:
4-chloranyl-N-(3-chlorophenyl)-3-sulfamoyl-benzamide 4-chloro-N-(3-chlorophenyl)-3-sulfamoylbenzamide cid_25693950
Type:
Small organic molecule
Emp. Form.:
C13H10Cl2N2O3S
Mol. Mass.:
345.201
SMILES:
NS(=O)(=O)c1cc(ccc1Cl)C(=O)Nc1cccc(Cl)c1
: