Target
Nuclear receptor coactivator 2
Ligand
BDBM42885
Substrate
Meas. Tech.
Dose response biochemical High Throughput Screening assay for agonists of the steroid receptor coactivator 2 (SRC-2) recruitment by the peroxisome proliferator-activated receptor gamma (PPARgamma)
EC50
>79370±n/a nM
Citation
 PubChem, PC Dose response biochemical High Throughput Screening assay for agonists of the steroid receptor coactivator 2 (SRC-2) recruitment by the peroxisome proliferator-activated receptor gamma (PPARgamma) PubChem Bioassay (2008)[AID] 
Target
Name:
Nuclear receptor coactivator 2
Synonyms:
BHLHE75 NCOA2 protein SRC2 | TIF2
Type:
Enzyme Catalytic Domain
Mol. Mass.:
159156.93
Organism:
Homo sapiens (Human)
Description:
Q15596
Residue:
1464
  
Inhibitor
Name:
BDBM42885
Synonyms:
2-(7-Ethyl-[1,3]dioxolo[4,5-g]quinolin-6-ylsulfanyl)-N-(5-methyl-isoxazol-3-yl)-acetamide 2-[(7-ethyl-[1,3]dioxolo[4,5-g]quinolin-6-yl)sulfanyl]-N-(5-methyl-1,2-oxazol-3-yl)ethanamide 2-[(7-ethyl-[1,3]dioxolo[4,5-g]quinolin-6-yl)thio]-N-(5-methylisoxazol-3-yl)acetamide SMR000013438 | cid_646901
Type:
Small organic molecule
Emp. Form.:
C18H17N3O4S
Mol. Mass.:
371.41
SMILES:
CCc1cc2cc3OCOc3cc2nc1SCC(=O)Nc1cc(C)on1
: