Target
Nuclear receptor coactivator 2
Ligand
BDBM37968
Substrate
Meas. Tech.
Dose response biochemical High Throughput Screening assay for agonists of the steroid receptor coactivator 2 (SRC-2) recruitment by the peroxisome proliferator-activated receptor gamma (PPARgamma)
EC50
>79370±n/a nM
Citation
 PubChem, PC Dose response biochemical High Throughput Screening assay for agonists of the steroid receptor coactivator 2 (SRC-2) recruitment by the peroxisome proliferator-activated receptor gamma (PPARgamma) PubChem Bioassay (2008)[AID] 
Target
Name:
Nuclear receptor coactivator 2
Synonyms:
BHLHE75 NCOA2 protein SRC2 | TIF2
Type:
Enzyme Catalytic Domain
Mol. Mass.:
159156.93
Organism:
Homo sapiens (Human)
Description:
Q15596
Residue:
1464
  
Inhibitor
Name:
BDBM37968
Synonyms:
3-Benzylsulfanyl-5-methyl-[1,2,4]triazol-4-ylamine 3-methyl-5-(phenylmethylsulfanyl)-1,2,4-triazol-4-amine MLS000072194 [3-(benzylthio)-5-methyl-1,2,4-triazol-4-yl]amine | cid_647885
Type:
Small organic molecule
Emp. Form.:
C10H12N4S
Mol. Mass.:
220.294
SMILES:
Cc1nnc(SCc2ccccc2)n1N
: