Target
Nuclear receptor coactivator 2
Ligand
BDBM42886
Substrate
Meas. Tech.
Dose response biochemical High Throughput Screening assay for agonists of the steroid receptor coactivator 2 (SRC-2) recruitment by the peroxisome proliferator-activated receptor gamma (PPARgamma)
EC50
77370±n/a nM
Citation
 PubChem, PC Dose response biochemical High Throughput Screening assay for agonists of the steroid receptor coactivator 2 (SRC-2) recruitment by the peroxisome proliferator-activated receptor gamma (PPARgamma) PubChem Bioassay (2008)[AID] 
Target
Name:
Nuclear receptor coactivator 2
Synonyms:
BHLHE75 NCOA2 protein SRC2 | TIF2
Type:
Enzyme Catalytic Domain
Mol. Mass.:
159156.93
Organism:
Homo sapiens (Human)
Description:
Q15596
Residue:
1464
  
Inhibitor
Name:
BDBM42886
Synonyms:
2-[[2-[[1-(3,4-dimethylphenyl)-5-tetrazolyl]thio]-1-oxoethyl]amino]-4-methyl-5-thiazolecarboxylic acid ethyl ester 2-{2-[1-(3,4-Dimethyl-phenyl)-1H-tetrazol-5-ylsulfanyl]-acetylamino}-4-methyl-thiazole-5-carboxylic acid ethyl ester SMR000004181 ethyl 2-[2-[[1-(3,4-dimethylphenyl)-1,2,3,4-tetrazol-5-yl]sulfanyl]ethanoylamino]-4-methyl-1,3-thiazole-5-carboxylate | ethyl 2-[[2-[1-(3,4-dimethylphenyl)tetrazol-5-yl]sulfanylacetyl]amino]-4-methyl-1,3-thiazole-5-carboxylate
Type:
Small organic molecule
Emp. Form.:
C18H20N6O3S2
Mol. Mass.:
432.52
SMILES:
CCOC(=O)c1sc(NC(=O)CSc2nnnn2-c2ccc(C)c(C)c2)nc1C
: