Target
Nuclear receptor coactivator 2
Ligand
BDBM42888
Substrate
Meas. Tech.
Dose response biochemical High Throughput Screening assay for agonists of the steroid receptor coactivator 2 (SRC-2) recruitment by the peroxisome proliferator-activated receptor gamma (PPARgamma)
EC50
>79370±n/a nM
Citation
 PubChem, PC Dose response biochemical High Throughput Screening assay for agonists of the steroid receptor coactivator 2 (SRC-2) recruitment by the peroxisome proliferator-activated receptor gamma (PPARgamma) PubChem Bioassay (2008)[AID] 
Target
Name:
Nuclear receptor coactivator 2
Synonyms:
BHLHE75 NCOA2 protein SRC2 | TIF2
Type:
Enzyme Catalytic Domain
Mol. Mass.:
159156.93
Organism:
Homo sapiens (Human)
Description:
Q15596
Residue:
1464
  
Inhibitor
Name:
BDBM42888
Synonyms:
3-Cyclohexyl-1-(2-diethylamino-ethyl)-1-(7-oxo-2,3,6,7-tetrahydro-[1,4]dioxino[2,3-g]quinolin-8-ylmethyl)-urea 3-cyclohexyl-1-[2-(diethylamino)ethyl]-1-[(7-oxidanylidene-3,6-dihydro-2H-[1,4]dioxino[2,3-g]quinolin-8-yl)methyl]urea MLS000031246 cid_649691
Type:
Small organic molecule
Emp. Form.:
C25H36N4O4
Mol. Mass.:
456.5777
SMILES:
CCN(CC)CCN(Cc1cc2cc3OCCOc3cc2[nH]c1=O)C(=O)NC1CCCCC1
: