Target
Nuclear receptor coactivator 2
Ligand
BDBM42894
Substrate
Meas. Tech.
Dose response biochemical High Throughput Screening assay for agonists of the steroid receptor coactivator 2 (SRC-2) recruitment by the peroxisome proliferator-activated receptor gamma (PPARgamma)
EC50
>79370±n/a nM
Citation
 PubChem, PC Dose response biochemical High Throughput Screening assay for agonists of the steroid receptor coactivator 2 (SRC-2) recruitment by the peroxisome proliferator-activated receptor gamma (PPARgamma) PubChem Bioassay (2008)[AID] 
Target
Name:
Nuclear receptor coactivator 2
Synonyms:
BHLHE75 NCOA2 protein SRC2 | TIF2
Type:
Enzyme Catalytic Domain
Mol. Mass.:
159156.93
Organism:
Homo sapiens (Human)
Description:
Q15596
Residue:
1464
  
Inhibitor
Name:
BDBM42894
Synonyms:
4-Methyl-4H-thieno[3,2-b]pyrrole-5-carboxylic acid 1-[(thiophen-2-ylmethyl)-carbamoyl]-ethyl ester 4-methylthieno[3,2-b]pyrrole-5-carboxylic acid [2-keto-1-methyl-2-(2-thenylamino)ethyl] ester SMR000008038 [1-oxo-1-(thiophen-2-ylmethylamino)propan-2-yl] 4-methylthieno[3,2-b]pyrrole-5-carboxylate | cid_653677
Type:
Small organic molecule
Emp. Form.:
C16H16N2O3S2
Mol. Mass.:
348.44
SMILES:
CC(OC(=O)c1cc2sccc2n1C)C(=O)NCc1cccs1
: