Target
Nuclear receptor coactivator 2
Ligand
BDBM42895
Substrate
Meas. Tech.
Dose response biochemical High Throughput Screening assay for agonists of the steroid receptor coactivator 2 (SRC-2) recruitment by the peroxisome proliferator-activated receptor gamma (PPARgamma)
EC50
>79370±n/a nM
Citation
 PubChem, PC Dose response biochemical High Throughput Screening assay for agonists of the steroid receptor coactivator 2 (SRC-2) recruitment by the peroxisome proliferator-activated receptor gamma (PPARgamma) PubChem Bioassay (2008)[AID] 
Target
Name:
Nuclear receptor coactivator 2
Synonyms:
BHLHE75 NCOA2 protein SRC2 | TIF2
Type:
Enzyme Catalytic Domain
Mol. Mass.:
159156.93
Organism:
Homo sapiens (Human)
Description:
Q15596
Residue:
1464
  
Inhibitor
Name:
BDBM42895
Synonyms:
3-[[(1-cyclopentyltetrazol-5-yl)methyl-piperonyl-amino]methyl]-8-methyl-carbostyril 3-[[1,3-benzodioxol-5-ylmethyl-[(1-cyclopentyl-5-tetrazolyl)methyl]amino]methyl]-8-methyl-1H-quinolin-2-one 3-{[Benzo[1,3]dioxol-5-ylmethyl-(1-cyclopentyl-1H-tetrazol-5-ylmethyl)-amino]-methyl}-8-methyl-1H-quinolin-2-one SMR000003195 | cid_654098
Type:
Small organic molecule
Emp. Form.:
C26H28N6O3
Mol. Mass.:
472.5389
SMILES:
Cc1cccc2cc(CN(Cc3nnnn3C3CCCC3)Cc3ccc4OCOc4c3)c(=O)[nH]c12
: